{"text_format":"1","workbook":"xlsx","n_sheets":7,"sheets":["VBA","INDEX","Defined Name","Cloud-Based ","Desktop Folder","Paste Link","Data"],"not_rendered":{"charts":0,"images":0,"macros":1,"external_links":2,"defined_names":0,"comments":0,"pivot_tables":0},"unopened":[],"bounds":{"document_bytes":16777216,"sheet_cells":100000,"rows_first":2000,"rows_last":500,"rows_between":2000,"halvings":0,"cell_chars":16384,"cell_head_chars":4096},"cells_cut":0,"cells_raw":0,"read":"whole","date_system":"1900"}

{"sheet":"VBA","index":0,"n_rows":38,"n_cols":7,"rows_kept":38,"cut":false,"hidden":false,"merged":[[2,1,2,2]]}
[]
[]
[null,"Grocery Items Price New"]
[]
[null,"Product","Price"]
[null,"Rice",60]
[null,"Oil",200]
[null,"Onion",50]
[null,"Egg",150]
[]
[]
[]
[]
[]
[]
[]
[]
[]
[]
[]
[null,null,null,null,null,null,0]
[]
[]
[]
[]
[]
[]
[]
[]
[]
[]
[]
[]
[null,"Product","Price","Increased Price"]
[null,"Rice",60]
[null,"Oil",200]
[null,"Onion",50]
[null,"Egg",150]

{"sheet":"INDEX","index":1,"n_rows":38,"n_cols":7,"rows_kept":38,"cut":false,"hidden":false,"merged":[[2,1,2,2]]}
[]
[]
[null,"Grocery Items Price New"]
[]
[null,"Product","Price"]
[null,"Rice",{"$f":"INDEX([1]Data!C:C,6,1)","v":60}]
[null,"Oil",{"$f":"INDEX([1]Data!C:C,7,1)","v":200}]
[null,"Onion",{"$f":"INDEX([1]Data!C:C,8,1)","v":50}]
[null,"Egg",{"$f":"INDEX([1]Data!C:C,9,1)","v":150}]
[]
[]
[]
[]
[]
[]
[]
[]
[]
[]
[]
[null,null,null,null,null,null,0]
[]
[]
[]
[]
[]
[]
[]
[]
[]
[]
[]
[]
[null,"Product","Price","Increased Price"]
[null,"Rice",60]
[null,"Oil",200]
[null,"Onion",50]
[null,"Egg",150]

{"sheet":"Defined Name","index":2,"n_rows":38,"n_cols":7,"rows_kept":38,"cut":false,"hidden":false,"merged":[[2,1,2,2]]}
[]
[]
[null,"Grocery Items Price New"]
[]
[null,"Product","Price"]
[null,"Rice",{"$f":"[1]Data!$C$6:$C$9","v":60}]
[null,"Oil",200]
[null,"Onion",50]
[null,"Egg",150]
[]
[]
[]
[]
[]
[]
[]
[]
[]
[]
[]
[null,null,null,null,null,null,0]
[]
[]
[]
[]
[]
[]
[]
[]
[]
[]
[]
[]
[null,"Product","Price","Increased Price"]
[null,"Rice",60]
[null,"Oil",200]
[null,"Onion",50]
[null,"Egg",150]

{"sheet":"Cloud-Based ","index":3,"n_rows":38,"n_cols":7,"rows_kept":38,"cut":false,"hidden":false,"merged":[[2,1,2,2]]}
[]
[]
[null,"Grocery Items Price New"]
[]
[null,"Product","Price"]
[null,"Rice",{"$f":"[2]Data!C6","v":60}]
[null,"Oil",{"$f":"[2]Data!C7","v":200}]
[null,"Onion",{"$f":"[2]Data!C8","v":50}]
[null,"Egg",{"$f":"[2]Data!C9","v":150}]
[]
[]
[]
[]
[]
[]
[]
[]
[]
[]
[]
[null,null,null,null,null,null,0]
[]
[]
[]
[]
[]
[]
[]
[]
[]
[]
[]
[]
[null,"Product","Price","Increased Price"]
[null,"Rice",60]
[null,"Oil",200]
[null,"Onion",50]
[null,"Egg",150]

{"sheet":"Desktop Folder","index":4,"n_rows":38,"n_cols":7,"rows_kept":38,"cut":false,"hidden":false,"merged":[[2,1,2,2]]}
[]
[]
[null,"Grocery Items Price New"]
[]
[null,"Product","Price"]
[null,"Rice",{"$f":"[1]Data!C6","v":60}]
[null,"Oil",{"$f":"[1]Data!C7","v":200}]
[null,"Onion",{"$f":"[1]Data!C8","v":50}]
[null,"Egg",{"$f":"[1]Data!C9","v":150}]
[]
[]
[]
[]
[]
[]
[]
[]
[]
[]
[]
[null,null,null,null,null,null,0]
[]
[]
[]
[]
[]
[]
[]
[]
[]
[]
[]
[]
[null,"Product","Price","Increased Price"]
[null,"Rice",60]
[null,"Oil",200]
[null,"Onion",50]
[null,"Egg",150]

{"sheet":"Paste Link","index":5,"n_rows":38,"n_cols":7,"rows_kept":38,"cut":false,"hidden":false,"merged":[[2,1,2,2]]}
[]
[]
[null,"Grocery Items Price New"]
[]
[null,"Product","Price"]
[null,"Rice",{"$f":"[1]Data!C6","v":60}]
[null,"Oil",{"$f":"[1]Data!C7","v":200}]
[null,"Onion",{"$f":"[1]Data!C8","v":50}]
[null,"Egg",{"$f":"[1]Data!C9","v":150}]
[]
[]
[]
[]
[]
[]
[]
[]
[]
[]
[]
[null,null,null,null,null,null,0]
[]
[]
[]
[]
[]
[]
[]
[]
[]
[]
[]
[]
[null,"Product","Price","Increased Price"]
[null,"Rice",60]
[null,"Oil",200]
[null,"Onion",50]
[null,"Egg",150]

{"sheet":"Data","index":6,"n_rows":38,"n_cols":7,"rows_kept":38,"cut":false,"hidden":false,"merged":[[2,1,2,2]]}
[]
[]
[null,"Grocery Items Price New"]
[]
[null,"Product","Price"]
[null,"Rice"]
[null,"Oil"]
[null,"Onion"]
[null,"Egg"]
[]
[]
[]
[]
[]
[]
[]
[]
[]
[]
[]
[null,null,null,null,null,null,0]
[]
[]
[]
[]
[]
[]
[]
[]
[]
[]
[]
[]
[null,"Product","Price","Increased Price"]
[null,"Rice",60]
[null,"Oil",200]
[null,"Onion",50]
[null,"Egg",150]